{"text_format":"1","workbook":"xlsx","n_sheets":5,"sheets":["Project Information","StaffDetails","Salary Information","RPU Budget_Template","Sheet1"],"not_rendered":{"charts":0,"images":0,"macros":1,"external_links":1,"defined_names":1,"comments":2,"pivot_tables":0},"unopened":[],"bounds":{"document_bytes":16777216,"sheet_cells":100000,"rows_first":2000,"rows_last":500,"rows_between":2000,"halvings":0,"cell_chars":16384,"cell_head_chars":4096},"cells_cut":0,"cells_raw":0,"read":"whole","date_system":"1900"}

{"sheet":"Project Information","index":0,"n_rows":100,"n_cols":12,"rows_kept":100,"cut":false,"hidden":false,"merged":[[78,3,78,8],[0,3,0,6],[10,4,10,9],[3,4,4,6],[69,3,69,8],[75,3,75,8],[75,9,76,9],[70,2,70,8],[71,2,71,8],[72,2,72,8],[73,2,73,8],[74,2,74,8],[77,3,77,8],[79,3,79,8],[80,3,80,8],[81,3,81,8],[82,3,82,8],[83,3,83,8],[89,3,89,8],[90,3,90,8],[91,3,91,8],[84,3,84,8],[85,3,85,8],[86,3,86,8],[87,3,87,8],[88,3,88,8]]}
[null,null,"Project Title:"]
[null,null,"Research Content:",null,null,"Non \nUNSW Markup",0.1,"UNSW Indirect \nMarkup",0.35]
[null,null,"RG Number:",null,null,"WRL Project Number:","WRL2018xxx"]
[null,null,"Start Date:",null,"Select the pricing timeframe",null,null,"2019-01-01","Note: Select \nPricing Period"]
[null,null,"End Date:"]
[null,null,"Client:"]
[null,null,"WRL Contact Name:","Smith, Grantley"]
[null,null,"WRL Contact phone:",{"$f":"IF(D7=\"\",\"\",VLOOKUP(D7,StaffDetails!A:N,13,FALSE))","v":80719862},null,"Email",{"$f":"IF(D7=\"\",\"\",VLOOKUP(D7,StaffDetails!A:N,14,FALSE))","v":"G.Smith@wrl.unsw.edu.au"}]
[null,null,"WRL Contact email:","b.miller@wrl.unsw.edu.au"]
[]
[null,null,null,null,"WRL Project Pricing Tool"]
[null,null,"Markup Factor",1,1,1,1,1,1,1]
[]
[null,null,null,{"$f":"IF(D12<1,1*(IF(D13=\"\",0,INDEX(StaffDetails!$D$3:$D$1048576,MATCH(D13,StaffDetails!$A$3:$A$1048576,FALSE)))),D12*(IF(D13=\"\",0,INDEX(StaffDetails!$D$3:$D$1048576,MATCH(D13,StaffDetails!$A$3:$A$1048576,FALSE)))))","v":0},{"$f":"IF(E12<1,1*(IF(E13=\"\",0,INDEX(StaffDetails!$D$3:$D$1048576,MATCH(E13,StaffDetails!$A$3:$A$1048576,FALSE)))),E12*(IF(E13=\"\",0,INDEX(StaffDetails!$D$3:$D$1048576,MATCH(E13,StaffDetails!$A$3:$A$1048576,FALSE)))))","v":0},{"$f":"IF(F12<1,1*(IF(F13=\"\",0,INDEX(StaffDetails!$D$3:$D$1048576,MATCH(F13,StaffDetails!$A$3:$A$1048576,FALSE)))),F12*(IF(F13=\"\",0,INDEX(StaffDetails!$D$3:$D$1048576,MATCH(F13,StaffDetails!$A$3:$A$1048576,FALSE)))))","v":0},{"$f":"IF(G12<1,1*(IF(G13=\"\",0,INDEX(StaffDetails!$D$3:$D$1048576,MATCH(G13,StaffDetails!$A$3:$A$1048576,FALSE)))),G12*(IF(G13=\"\",0,INDEX(StaffDetails!$D$3:$D$1048576,MATCH(G13,StaffDetails!$A$3:$A$1048576,FALSE)))))","v":0},{"$f":"IF(H12<1,1*(IF(H13=\"\",0,INDEX(StaffDetails!$D$3:$D$1048576,MATCH(H13,StaffDetails!$A$3:$A$1048576,FALSE)))),H12*(IF(H13=\"\",0,INDEX(StaffDetails!$D$3:$D$1048576,MATCH(H13,StaffDetails!$A$3:$A$1048576,FALSE)))))","v":0},{"$f":"IF(I12<1,1*(IF(I13=\"\",0,INDEX(StaffDetails!$D$3:$D$1048576,MATCH(I13,StaffDetails!$A$3:$A$1048576,FALSE)))),I12*(IF(I13=\"\",0,INDEX(StaffDetails!$D$3:$D$1048576,MATCH(I13,StaffDetails!$A$3:$A$1048576,FALSE)))))","v":0},{"$f":"IF(J12<1,1*(IF(J13=\"\",0,INDEX(StaffDetails!$D$3:$D$1048576,MATCH(J13,StaffDetails!$A$3:$A$1048576,FALSE)))),J12*(IF(J13=\"\",0,INDEX(StaffDetails!$D$3:$D$1048576,MATCH(J13,StaffDetails!$A$3:$A$1048576,FALSE)))))","v":0}]
[]
[null,null,"Total",{"$f":"IF(D13=\"\",\"\",SUM(D20:D69))","v":""},"","","","","",""]
[null,null,"Effective Days worked \n(1 Day = 7hrs)",{"$f":"IF(D16=\"\",\"\",IF(D16>0,D16/7,\"\"))","v":""},{"$f":"IF(E16=\"\",\"\",IF(E16>0,E16/7,\"\"))","v":""},"",{"$f":"IF(G16=\"\",\"\",IF(G16>0,G16/7,\"\"))","v":""},"","",""]
[]
[null,"Activity","Description",{"$f":"D13&\" Hrs\"","v":" Hrs"},{"$f":"E13&\" Hrs\"","v":" Hrs"},{"$f":"F13&\" Hrs\"","v":" Hrs"},{"$f":"G13&\" Hrs\"","v":" Hrs"}," Hrs"," Hrs"," Hrs",null,"Revenue A$"]
[null,1,null,null,null,null,null,null,null,null,null,{"$f":"SUMPRODUCT($D$14:$J$14,D20:J20)","v":0}]
{"$rows_left_out":81}
{"sheet":"StaffDetails","index":1,"n_rows":33,"n_cols":14,"rows_kept":33,"cut":false,"hidden":false,"merged":[]}
["Source: Rates Updated from UNSW HR Website 5/12/2018 - https://www.hr.unsw.edu.au/services/salaries",null,null,null,null,null,null,null,null,{"$f":"'Project Information'!H4","v":"2019-01-01"}]
["Name","Salary Level","Superannuation Rate","2019 Chargeout","Adjusted Charge Out - \n(Where Applicable)",null,"Classification ","Level ","Step","Daily Rate (base salary and loadings)","Daily Rate to sponsor (incl all costs)",null,"Phone","Email "]
[]
["Anderson, Douglas","General Staff 8 5",0.17,220,{"$f":"IF(ISNA(HLOOKUP([1]StaffDetails!A4,'[1]Project Information'!$D$13:$J$14,2,FALSE)),D4,(HLOOKUP([1]StaffDetails!A4,'[1]Project Information'!$D$13:$J$14,2,FALSE)))","v":220},null,"General Staff ",{"$f":"IF(LEFT(B4,1)=\"G\", IF(RIGHT(B4,1)=\"n\",MID(B4,15,3),MID(B4,15,1)),MID(B4,16,1))","v":"8"},{"$f":"IF(LEFT(B4,1)=\"G\", IF(RIGHT(B4,1)=\"n\",RIGHT(B4,3),RIGHT(B4,1)),RIGHT(B4,1))","v":"5"},{"$f":"VLOOKUP(B4,'[1]Salary Information'!$A:$L,MATCH($J$1,'[1]Salary Information'!$A$1:$L$1,0),FALSE)","v":484.81048387096774},{"$f":"E4*7","v":1540},null,80719848,"d.anderson@wrl.unsw.edu.au"]
["Blacka, Anna","General Staff 4 3",0.17,125,{"$f":"IF(ISNA(HLOOKUP([1]StaffDetails!A5,'[1]Project Information'!$D$13:$J$14,2,FALSE)),D5,(HLOOKUP([1]StaffDetails!A5,'[1]Project Information'!$D$13:$J$14,2,FALSE)))","v":125},null,"General Staff ",{"$f":"IF(LEFT(B5,1)=\"G\", IF(RIGHT(B5,1)=\"n\",MID(B5,15,3),MID(B5,15,1)),MID(B5,16,1))","v":"4"},{"$f":"IF(LEFT(B5,1)=\"G\", IF(RIGHT(B5,1)=\"n\",RIGHT(B5,3),RIGHT(B5,1)),RIGHT(B5,1))","v":"3"},{"$f":"VLOOKUP(B5,'[1]Salary Information'!$A:$L,MATCH($J$1,'[1]Salary Information'!$A$1:$L$1,0),FALSE)","v":289.89112903225805},875,null,80719837,"a.blacka@wrl.unsw.edu.au"]
["Blacka, Matthew","General Staff 8 5",0.17,220,{"$f":"IF(ISNA(HLOOKUP([1]StaffDetails!A6,'[1]Project Information'!$D$13:$J$14,2,FALSE)),D6,(HLOOKUP([1]StaffDetails!A6,'[1]Project Information'!$D$13:$J$14,2,FALSE)))","v":220},null,"General Staff ","8","5",{"$f":"VLOOKUP(B6,'[1]Salary Information'!$A:$L,MATCH($J$1,'[1]Salary Information'!$A$1:$L$1,0),FALSE)","v":484.81048387096774},1540,null,80719837,"m.blacka@wrl.unsw.edu.au"]
["Carley, James","Academic Staff C 6",0.17,260,{"$f":"IF(ISNA(HLOOKUP([1]StaffDetails!A7,'[1]Project Information'!$D$13:$J$14,2,FALSE)),D7,(HLOOKUP([1]StaffDetails!A7,'[1]Project Information'!$D$13:$J$14,2,FALSE)))","v":260},null,"Academic Staff ","C","6",{"$f":"VLOOKUP(B7,'[1]Salary Information'!$A:$L,MATCH($J$1,'[1]Salary Information'!$A$1:$L$1,0),FALSE)","v":602.39516129032256},1820,null,80719863,"james.carley@unsw.edu.au"]
["Carlino, Grace","General Staff 4 3",0.17,125,{"$f":"IF(ISNA(HLOOKUP([1]StaffDetails!A8,'[1]Project Information'!$D$13:$J$14,2,FALSE)),D8,(HLOOKUP([1]StaffDetails!A8,'[1]Project Information'!$D$13:$J$14,2,FALSE)))","v":125},null,"General Staff ","4","3",{"$f":"VLOOKUP(B8,'[1]Salary Information'!$A:$L,MATCH($J$1,'[1]Salary Information'!$A$1:$L$1,0),FALSE)","v":289.89112903225805},{"$f":"E8*7","v":875},null,80719841,"g.carlino@wrl.unsw.edu.au"]
["Coghlan, Ian","General Staff 7 4",0.17,185,{"$f":"IF(ISNA(HLOOKUP([1]StaffDetails!A9,'[1]Project Information'!$D$13:$J$14,2,FALSE)),D9,(HLOOKUP([1]StaffDetails!A9,'[1]Project Information'!$D$13:$J$14,2,FALSE)))","v":185},null,"General Staff ","7","4",{"$f":"VLOOKUP(B9,'[1]Salary Information'!$A:$L,MATCH($J$1,'[1]Salary Information'!$A$1:$L$1,0),FALSE)","v":416.60483870967744},1295,null,80719866,"i.coghlan@wrl.unsw.edu.au"]
["Cox, Ron","Academic Staff D 4",0.17,350,{"$f":"IF(ISNA(HLOOKUP([1]StaffDetails!A10,'[1]Project Information'!$D$13:$J$14,2,FALSE)),D10,(HLOOKUP([1]StaffDetails!A10,'[1]Project Information'!$D$13:$J$14,2,FALSE)))","v":350},null,"Academic Staff","D","4",{"$f":"VLOOKUP(B10,'[1]Salary Information'!$A:$L,MATCH($J$1,'[1]Salary Information'!$A$1:$L$1,0),FALSE)","v":690},2450,null,80719832,"r.cox@unsw.edu.au"]
["Drummond, Chris","General Staff 6 1",0.17,165,{"$f":"IF(ISNA(HLOOKUP([1]StaffDetails!A11,'[1]Project Information'!$D$13:$J$14,2,FALSE)),D11,(HLOOKUP([1]StaffDetails!A11,'[1]Project Information'!$D$13:$J$14,2,FALSE)))","v":165},null,"General Staff ","6","1",{"$f":"VLOOKUP(B11,'[1]Salary Information'!$A:$L,MATCH($J$1,'[1]Salary Information'!$A$1:$L$1,0),FALSE)","v":350.93951612903226},1155,null,80719874,"c.drummond@wrl.unsw.edu.au"]
["Deiber, Mathieu","General Staff 6 1",0.17,155,{"$f":"IF(ISNA(HLOOKUP([1]StaffDetails!A12,'[1]Project Information'!$D$13:$J$14,2,FALSE)),D12,(HLOOKUP([1]StaffDetails!A12,'[1]Project Information'!$D$13:$J$14,2,FALSE)))","v":155},null,"General Staff ","6","1",{"$f":"VLOOKUP(B12,'[1]Salary Information'!$A:$L,MATCH($J$1,'[1]Salary Information'!$A$1:$L$1,0),FALSE)","v":350.93951612903226},{"$f":"E12*7","v":1085},null,80719847,"m.deiber@wrl.unsw.edu.au"]
["Flocard, Francois","General Staff 8 1",0.17,220,{"$f":"IF(ISNA(HLOOKUP([1]StaffDetails!A13,'[1]Project Information'!$D$13:$J$14,2,FALSE)),D13,(HLOOKUP([1]StaffDetails!A13,'[1]Project Information'!$D$13:$J$14,2,FALSE)))","v":220},null,"General Staff ","8","1",{"$f":"VLOOKUP(B13,'[1]Salary Information'!$A:$L,MATCH($J$1,'[1]Salary Information'!$A$1:$L$1,0),FALSE)","v":430.28629032258067},{"$f":"E13*7","v":1540},null,80719823,"f.flocard@wrl.unsw.edu.au"]
["Harrison, Alice","General Staff 6 1",0.17,155,{"$f":"IF(ISNA(HLOOKUP([1]StaffDetails!A14,'[1]Project Information'!$D$13:$J$14,2,FALSE)),D14,(HLOOKUP([1]StaffDetails!A14,'[1]Project Information'!$D$13:$J$14,2,FALSE)))","v":155},null,"General Staff ","6","1",{"$f":"VLOOKUP(B14,'[1]Salary Information'!$A:$L,MATCH($J$1,'[1]Salary Information'!$A$1:$L$1,0),FALSE)","v":350.93951612903226},{"$f":"E14*7","v":1085},null,80719867,"a.harrison@wrl.unsw.edu.au"]
["Howe, Dan","General Staff 6 2",0.17,155,{"$f":"IF(ISNA(HLOOKUP([1]StaffDetails!A15,'[1]Project Information'!$D$13:$J$14,2,FALSE)),D15,(HLOOKUP([1]StaffDetails!A15,'[1]Project Information'!$D$13:$J$14,2,FALSE)))","v":155},null,"General Staff ","6","2",{"$f":"VLOOKUP(B15,'[1]Salary Information'!$A:$L,MATCH($J$1,'[1]Salary Information'!$A$1:$L$1,0),FALSE)","v":362.57661290322579},{"$f":"E15*7","v":1085},null,80719856,"d.howe@wrl.unsw.edu.au"]
["Glamore, William","Academic Staff D 1",0.17,285,{"$f":"IF(ISNA(HLOOKUP([1]StaffDetails!A16,'[1]Project Information'!$D$13:$J$14,2,FALSE)),D16,(HLOOKUP([1]StaffDetails!A16,'[1]Project Information'!$D$13:$J$14,2,FALSE)))","v":285},null,"Academic Staff","D","1",{"$f":"VLOOKUP(B16,'[1]Salary Information'!$A:$L,MATCH($J$1,'[1]Salary Information'!$A$1:$L$1,0),FALSE)","v":628.16532258064512},1995,null,80719868,"w.glamore@wrl.unsw.edu.au"]
["Jenkins, Rob","General Staff 6 3",0.17,125,{"$f":"IF(ISNA(HLOOKUP([1]StaffDetails!A17,'[1]Project Information'!$D$13:$J$14,2,FALSE)),D17,(HLOOKUP([1]StaffDetails!A17,'[1]Project Information'!$D$13:$J$14,2,FALSE)))","v":125},null,"General Staff ","6","3",{"$f":"VLOOKUP(B17,'[1]Salary Information'!$A:$L,MATCH($J$1,'[1]Salary Information'!$A$1:$L$1,0),FALSE)","v":374.36693548387098},875,null,80719830,"r.jenkins@wrl.unsw.edu.au"]
["Johnson, Coral","General Staff 4 3",0.17,125,{"$f":"IF(ISNA(HLOOKUP([1]StaffDetails!A18,'[1]Project Information'!$D$13:$J$14,2,FALSE)),D18,(HLOOKUP([1]StaffDetails!A18,'[1]Project Information'!$D$13:$J$14,2,FALSE)))","v":125},null,"General Staff ","4","3",{"$f":"VLOOKUP(B18,'[1]Salary Information'!$A:$L,MATCH($J$1,'[1]Salary Information'!$A$1:$L$1,0),FALSE)","v":289.89112903225805},875,null,80719827,"c.johnson@wrl.unsw.edu.au"]
["Lumiatti, Gabriela","General Staff 5 3",0.17,150,{"$f":"IF(ISNA(HLOOKUP([1]StaffDetails!A19,'[1]Project Information'!$D$13:$J$14,2,FALSE)),D19,(HLOOKUP([1]StaffDetails!A19,'[1]Project Information'!$D$13:$J$14,2,FALSE)))","v":150},null,"General Staff ","5","3",{"$f":"VLOOKUP(B19,'[1]Salary Information'!$A:$L,MATCH($J$1,'[1]Salary Information'!$A$1:$L$1,0),FALSE)","v":319.45161290322579},1050,null,80719843,"g.lumiatti@wrl.unsw.edu.au"]
["Mathews, Ross","General Staff 5 5",0.17,125,{"$f":"IF(ISNA(HLOOKUP([1]StaffDetails!A20,'[1]Project Information'!$D$13:$J$14,2,FALSE)),D20,(HLOOKUP([1]StaffDetails!A20,'[1]Project Information'!$D$13:$J$14,2,FALSE)))","v":125},null,"General Staff ","5","5",{"$f":"VLOOKUP(B20,'[1]Salary Information'!$A:$L,MATCH($J$1,'[1]Salary Information'!$A$1:$L$1,0),FALSE)","v":339.17741935483872},875,null,80719831,"ross.mathews@unsw.edu.au"]
{"$rows_left_out":14}
{"sheet":"Salary Information","index":2,"n_rows":85,"n_cols":16,"rows_kept":85,"cut":false,"hidden":true,"merged":[]}
[null,"2018-01-01","2018-07-01","2019-01-01","2019-07-01","2020-01-01","2020-07-01"]
["Salary Information",null,null,null,null,null,null,null,null,null,null,null,null,null,null,"https://www.hr.unsw.edu.au/services/salaries/acadsal.html"]
[null,"Daily Rate",null,null,null,null,null,null,null,null,null,null,null,null,null,"Updated 5/12/2018 from UNSW HR Website"]
[null,{"$f":"B5&B6","v":"2018 1 Jan - 30 Jun"},{"$f":"C5&C6","v":"2018 1 Jul - 31 Dec"},"2019 1 Jan - 30 Jun",{"$f":"E5&E6","v":"2019 1 Jul - 31 Dec"},"2020 1 Jan - 30 Jun","2020 1 Jul - 31 Dec","2018 1 Jan - 30 Jun",{"$f":"I5&I6","v":"2018 1 Jul - 31 Dec"},"2019 1 Jan - 30 Jun","2019 1 Jul - 31 Dec","2020 1 Jan - 30 Jun",{"$f":"M5&M6","v":"2020 1 Jul - 31 Dec"}]
[null,2018,2018,2019,2019,2020,2020,2018,2018,2019,{"$f":"I5+1","v":2019},{"$f":"J5+1","v":2020},{"$f":"K5+1","v":2020}]
["Category"," 1 Jan - 30 Jun"," 1 Jul - 31 Dec"," 1 Jan - 30 Jun"," 1 Jul - 31 Dec"," 1 Jan - 30 Jun"," 1 Jul - 31 Dec"," 1 Jan - 30 Jun"," 1 Jul - 31 Dec"," 1 Jan - 30 Jun"," 1 Jul - 31 Dec"," 1 Jan - 30 Jun"," 1 Jul - 31 Dec"]
["Academic Staff A 1",{"$f":"H7/248","v":296.76209677419354},{"$f":"I7/248","v":302.69758064516128},308.75,311.83870967741933,{"$f":"L7/248","v":314.95564516129031},{"$f":"M7/248","v":318.10483870967744},73597,75069,76570,77336,78109,78890,79679]
["Academic Staff A 2",{"$f":"H8/248","v":312.45161290322579},{"$f":"I8/248","v":318.70161290322579},{"$f":"J8/248","v":325.07661290322579},{"$f":"K8/248","v":328.32661290322579},{"$f":"L8/248","v":331.60887096774195},{"$f":"M8/248","v":334.92338709677421},77488,79038,80619,81425,82239,83061,83892]
["Academic Staff A 3",328.30241935483872,334.86693548387098,341.56451612903226,344.97983870967744,348.43145161290323,351.91532258064518,81419,83047,84708,85555,86411,87275,88148]
["Academic Staff A 4",344.16129032258067,351.04435483870969,358.06451612903226,361.64516129032256,365.26209677419354,368.91532258064518,85352,87059,88800,89688,90585,91491,92406]
["Academic Staff A 5",357.05241935483872,364.19354838709677,371.47580645161293,375.19354838709677,378.94354838709677,382.73387096774195,88549,90320,92126,93048,93978,94918,95867]
["Academic Staff A 6",369.93145161290323,377.33064516129031,384.875,388.72580645161293,392.61290322580646,396.54032258064518,91743,93578,95449,96404,97368,98342,99325]
["Academic Staff A",382.81048387096774,390.46774193548384,398.27419354838707,402.25806451612902,406.28225806451616,410.34274193548384,94937,96836,98772,99760,100758,101765,102783]
["Academic Staff A",395.67338709677421,403.58870967741933,411.65725806451616,415.77419354838707,419.93145161290323,424.13306451612902,98127,100090,102091,103112,104143,105185,106237]
["Academic Staff B 1",504.67741935483872,514.77016129032256,525.06451612903231,530.31854838709683,535.62096774193549,540.97580645161293,125160,127663,130216,131519,132834,134162,135504]
["Academic Staff B 2",519.54435483870964,529.93548387096769,540.5322580645161,545.93951612903231,551.39919354838707,556.91129032258061,128847,131424,134052,135393,136747,138114,139495]
["Academic Staff B 3",534.39919354838707,545.08870967741939,555.98790322580646,561.54838709677415,567.16532258064512,572.83467741935488,132531,135182,137885,139264,140657,142063,143484]
["Academic Staff B 4",549.27016129032256,560.25403225806451,571.45967741935488,577.17338709677415,582.94758064516134,588.77822580645159,136219,138943,141722,143139,144571,146017,147477]
["Academic Staff B 5",564.125,575.4072580645161,586.91532258064512,592.78629032258061,598.71370967741939,604.70161290322585,139903,142701,145555,147011,148481,149966,151465]
["Academic Staff B 6",579.00403225806451,590.58467741935488,602.39516129032256,608.41935483870964,614.50403225806451,620.64919354838707,143593,146465,149394,150888,152397,153921,155460]
{"$rows_left_out":66}
{"sheet":"RPU Budget_Template","index":3,"n_rows":103,"n_cols":19,"rows_kept":103,"cut":false,"hidden":true,"merged":[[3,1,3,4],[54,2,54,3],[54,4,54,5]]}
["BUDGET TABLE",null,null,null,"Generated on:",null,null,null,null,null,null,null,null,null,{"$f":"'Project Information'!G3&\" - \"&DAY(F1)&\"-\"&MONTH(F1)&\"-\"&YEAR(F1)","v":"WRL2018xxx - 0-1-1900"}]
[]
["Project Title:"]
["Project Sponsor:"]
["Project Start Date:",null,"Project End Date:"]
[]
["UNSW Personnel:","Classification","Level","Step","Start Date","End Date","Location","UNSW Indirect %","Markup %"]
[null,{"$f":"IF(A8=\"\",\"\",VLOOKUP(A8,StaffDetails!A:K,7,FALSE))","v":""},{"$f":"IF(A8=\"\",\"\",VLOOKUP(A8,StaffDetails!A:K,8,FALSE))","v":""},{"$f":"IF(A8=\"\",\"\",VLOOKUP(A8,StaffDetails!A:K,9,FALSE))","v":""},{"$f":"IF(A8=\"\",\"\",$B$5)","v":""},{"$f":"IF(A8=\"\",\"\",$D$5)","v":""},{"$f":"IF(A8=\"\",\"\",\"UNSW (excluding Canberra campus)\")","v":""},{"$f":"IF(A8=\"\",\"\",'Project Information'!$I$2)","v":""},{"$f":"IF(A8=\"\",\"\",R18)","v":""}]
[null,{"$f":"IF(A9=\"\",\"\",VLOOKUP(A9,StaffDetails!A:K,7,FALSE))","v":""},{"$f":"IF(A9=\"\",\"\",VLOOKUP(A9,StaffDetails!A:K,8,FALSE))","v":""},{"$f":"IF(A9=\"\",\"\",VLOOKUP(A9,StaffDetails!A:K,9,FALSE))","v":""},{"$f":"IF(A9=\"\",\"\",$B$5)","v":""},{"$f":"IF(A9=\"\",\"\",$D$5)","v":""},{"$f":"IF(A9=\"\",\"\",\"UNSW (excluding Canberra campus)\")","v":""},{"$f":"IF(A9=\"\",\"\",$H$8)","v":""},""]
[null,{"$f":"IF(A10=\"\",\"\",VLOOKUP(A10,StaffDetails!A:K,7,FALSE))","v":""},{"$f":"IF(A10=\"\",\"\",VLOOKUP(A10,StaffDetails!A:K,8,FALSE))","v":""},{"$f":"IF(A10=\"\",\"\",VLOOKUP(A10,StaffDetails!A:K,9,FALSE))","v":""},"","","",{"$f":"IF(A10=\"\",\"\",$H$8)","v":""},""]
[null,{"$f":"IF(A11=\"\",\"\",VLOOKUP(A11,StaffDetails!A:K,7,FALSE))","v":""},{"$f":"IF(A11=\"\",\"\",VLOOKUP(A11,StaffDetails!A:K,8,FALSE))","v":""},{"$f":"IF(A11=\"\",\"\",VLOOKUP(A11,StaffDetails!A:K,9,FALSE))","v":""},"","","","",""]
[null,{"$f":"IF(A12=\"\",\"\",VLOOKUP(A12,StaffDetails!A:K,7,FALSE))","v":""},{"$f":"IF(A12=\"\",\"\",VLOOKUP(A12,StaffDetails!A:K,8,FALSE))","v":""},{"$f":"IF(A12=\"\",\"\",VLOOKUP(A12,StaffDetails!A:K,9,FALSE))","v":""},"","","","",""]
[null,{"$f":"IF(A13=\"\",\"\",VLOOKUP(A13,StaffDetails!A:K,7,FALSE))","v":""},{"$f":"IF(A13=\"\",\"\",VLOOKUP(A13,StaffDetails!A:K,8,FALSE))","v":""},{"$f":"IF(A13=\"\",\"\",VLOOKUP(A13,StaffDetails!A:K,9,FALSE))","v":""},"","","","",""]
[null,{"$f":"IF(A14=\"\",\"\",VLOOKUP(A14,StaffDetails!A:K,7,FALSE))","v":""},{"$f":"IF(A14=\"\",\"\",VLOOKUP(A14,StaffDetails!A:K,8,FALSE))","v":""},{"$f":"IF(A14=\"\",\"\",VLOOKUP(A14,StaffDetails!A:K,9,FALSE))","v":""},"","","","",""]
[null,{"$f":"IF(A15=\"\",\"\",VLOOKUP(A15,StaffDetails!A:K,7,FALSE))","v":""},{"$f":"IF(A15=\"\",\"\",VLOOKUP(A15,StaffDetails!A:K,8,FALSE))","v":""},{"$f":"IF(A15=\"\",\"\",VLOOKUP(A15,StaffDetails!A:K,9,FALSE))","v":""},"","","","",""]
[]
["UNSW Personnel Costs:","Period Start","Period End","FTE","Daily Rate (base salary and loadings)","Daily rate to sponsor (incl all costs)","Work Days","Base Salary Cost","Superannuation %","Total Salary On-Costs","Markup Rate ($)","UNSW Indirect Costs","Total Cost",null,null,null,"Sal_Markup_Factor","Markup Rate (%)","UNSW Indirect (%)"]
[null,{"$f":"IF(A18=\"\",\"\",$B$5)","v":""},{"$f":"IF(A18=\"\",\"\",$D$5)","v":""},null,{"$f":"IF(A18=\"\",\"\",VLOOKUP(A18,StaffDetails!A:K,10,FALSE))","v":""},{"$f":"IF(A18=\"\",\"\",VLOOKUP(A18,StaffDetails!A:K,11,FALSE))","v":""},null,{"$f":"IF(A18=\"\",\"\",E18*G18)","v":""},{"$f":"IF(A18=\"\",\"\",VLOOKUP(A18,StaffDetails!A:K,3,FALSE))","v":""},{"$f":"IF(A18=\"\",\"\",IF(I18=0.17,H18*0.294165,H18*0.215078))","v":""},{"$f":"IF(A18=\"\",\"\",(G18*7*(VLOOKUP(A18,StaffDetails!A:K,5,FALSE)))-L18-J18-H18)","v":""},{"$f":"IF(A18=\"\",\"\",(H18+J18)*S18)","v":""},{"$f":"IF(A18=\"\",\"\",H18+J18+K18+L18)","v":""},null,null,null,null,{"$f":"IF(A18=\"\",\"\",K18/(J18+H18))","v":""},{"$f":"IF(A18=\"\",\"\",'Project Information'!$I$2)","v":""}]
[null,{"$f":"IF(A19=\"\",\"\",$B$5)","v":""},{"$f":"IF(A19=\"\",\"\",$D$5)","v":""},null,{"$f":"IF(A19=\"\",\"\",VLOOKUP(A19,StaffDetails!A:K,10,FALSE))","v":""},{"$f":"IF(A19=\"\",\"\",VLOOKUP(A19,StaffDetails!A:K,11,FALSE))","v":""},null,{"$f":"IF(A19=\"\",\"\",E19*G19)","v":""},{"$f":"IF(A19=\"\",\"\",VLOOKUP(A19,StaffDetails!A:K,3,FALSE))","v":""},{"$f":"IF(A19=\"\",\"\",IF(I19=0.17,H19*0.294165,H19*0.215078))","v":""},{"$f":"IF(A19=\"\",\"\",(G19*7*(VLOOKUP(A19,StaffDetails!A:K,5,FALSE)))-L19-J19-H19)","v":""},"","",null,null,null,null,"",{"$f":"IF(A9=\"\",\"\",$S$18)","v":""}]
[null,"","",null,{"$f":"IF(A20=\"\",\"\",VLOOKUP(A20,StaffDetails!A:K,10,FALSE))","v":""},{"$f":"IF(A20=\"\",\"\",VLOOKUP(A20,StaffDetails!A:K,11,FALSE))","v":""},null,"",{"$f":"IF(A20=\"\",\"\",VLOOKUP(A20,StaffDetails!A:K,3,FALSE))","v":""},"",{"$f":"IF(A20=\"\",\"\",(G20*7*(VLOOKUP(A20,StaffDetails!A:K,5,FALSE)))-L20-J20-H20)","v":""},"","",null,null,null,null,"",""]
{"$rows_left_out":84}
{"sheet":"Sheet1","index":4,"n_rows":0,"n_cols":0,"rows_kept":0,"cut":false,"hidden":true,"merged":[]}