{"text_format":"1","workbook":"xlsx","n_sheets":5,"sheets":["Project Information","RPU Budget_Template","debug","StaffDetails","Salary Information"],"not_rendered":{"charts":0,"images":0,"macros":1,"external_links":0,"defined_names":1,"comments":2,"pivot_tables":0},"unopened":[],"bounds":{"document_bytes":16777216,"sheet_cells":100000,"rows_first":2000,"rows_last":500,"rows_between":2000,"halvings":0,"cell_chars":16384,"cell_head_chars":4096},"cells_cut":0,"cells_raw":0,"read":"whole","date_system":"1900"}

{"sheet":"Project Information","index":0,"n_rows":100,"n_cols":15,"rows_kept":100,"cut":false,"hidden":false,"merged":[[0,3,0,6],[10,4,10,12],[3,4,4,6],[69,3,69,8],[75,3,75,8],[75,12,76,12]]}
[null,null,"Project Title:"]
[null,null,"Research Content:",null,null,"Non \nUNSW Markup Factor",0.35,null,0.35]
[null,null,"RG Number:",null,null,"WRL Project Number:","WRL2020xx"]
[null,null,"Start Date:",null,"Select the pricing timeframe (where the majority of work will take place)",null,null,"2020-07-01"]
[null,null,"End Date:"]
[null,null,"Client:"]
[null,null,"WRL Contact Name:","Smith, Grantley"]
[null,null,"WRL Contact phone:",{"$f":"IF(D7=\"\",\"\",VLOOKUP(D7,StaffDetails!A:N,13,FALSE))","v":80719862},null,"Email",{"$f":"IF(D7=\"\",\"\",VLOOKUP(D7,StaffDetails!A:N,14,FALSE))","v":"G.Smith@wrl.unsw.edu.au"}]
[null,null,"WRL Contact email:","b.miller@wrl.unsw.edu.au"]
[]
[null,null,null,null,"WRL Project Pricing Tool"]
[null,null,"Markup Factor",1,1,1,1,1,1,1,1,1,1]
[null,null,null,"Smith, Grantley"]
[null,null,null,{"$f":"IF(D12<1,1*(IF(D13=\"\",0,INDEX(StaffDetails!$D$3:$D$1048576,MATCH(D13,StaffDetails!$A$3:$A$1048576,FALSE)))),D12*(IF(D13=\"\",0,INDEX(StaffDetails!$D$3:$D$1048576,MATCH(D13,StaffDetails!$A$3:$A$1048576,FALSE)))))","v":320},{"$f":"IF(E12<1,1*(IF(E13=\"\",0,INDEX(StaffDetails!$D$3:$D$1048576,MATCH(E13,StaffDetails!$A$3:$A$1048576,FALSE)))),E12*(IF(E13=\"\",0,INDEX(StaffDetails!$D$3:$D$1048576,MATCH(E13,StaffDetails!$A$3:$A$1048576,FALSE)))))","v":0},{"$f":"IF(F12<1,1*(IF(F13=\"\",0,INDEX(StaffDetails!$D$3:$D$1048576,MATCH(F13,StaffDetails!$A$3:$A$1048576,FALSE)))),F12*(IF(F13=\"\",0,INDEX(StaffDetails!$D$3:$D$1048576,MATCH(F13,StaffDetails!$A$3:$A$1048576,FALSE)))))","v":0},{"$f":"IF(G12<1,1*(IF(G13=\"\",0,INDEX(StaffDetails!$D$3:$D$1048576,MATCH(G13,StaffDetails!$A$3:$A$1048576,FALSE)))),G12*(IF(G13=\"\",0,INDEX(StaffDetails!$D$3:$D$1048576,MATCH(G13,StaffDetails!$A$3:$A$1048576,FALSE)))))","v":0},{"$f":"IF(H12<1,1*(IF(H13=\"\",0,INDEX(StaffDetails!$D$3:$D$1048576,MATCH(H13,StaffDetails!$A$3:$A$1048576,FALSE)))),H12*(IF(H13=\"\",0,INDEX(StaffDetails!$D$3:$D$1048576,MATCH(H13,StaffDetails!$A$3:$A$1048576,FALSE)))))","v":0},{"$f":"IF(I12<1,1*(IF(I13=\"\",0,INDEX(StaffDetails!$D$3:$D$1048576,MATCH(I13,StaffDetails!$A$3:$A$1048576,FALSE)))),I12*(IF(I13=\"\",0,INDEX(StaffDetails!$D$3:$D$1048576,MATCH(I13,StaffDetails!$A$3:$A$1048576,FALSE)))))","v":0},{"$f":"IF(J12<1,1*(IF(J13=\"\",0,INDEX(StaffDetails!$D$3:$D$1048576,MATCH(J13,StaffDetails!$A$3:$A$1048576,FALSE)))),J12*(IF(J13=\"\",0,INDEX(StaffDetails!$D$3:$D$1048576,MATCH(J13,StaffDetails!$A$3:$A$1048576,FALSE)))))","v":0},{"$f":"IF(K12<1,1*(IF(K13=\"\",0,INDEX(StaffDetails!$D$3:$D$1048576,MATCH(K13,StaffDetails!$A$3:$A$1048576,FALSE)))),K12*(IF(K13=\"\",0,INDEX(StaffDetails!$D$3:$D$1048576,MATCH(K13,StaffDetails!$A$3:$A$1048576,FALSE)))))","v":0},{"$f":"IF(L12<1,1*(IF(L13=\"\",0,INDEX(StaffDetails!$D$3:$D$1048576,MATCH(L13,StaffDetails!$A$3:$A$1048576,FALSE)))),L12*(IF(L13=\"\",0,INDEX(StaffDetails!$D$3:$D$1048576,MATCH(L13,StaffDetails!$A$3:$A$1048576,FALSE)))))","v":0},{"$f":"IF(M12<1,1*(IF(M13=\"\",0,INDEX(StaffDetails!$D$3:$D$1048576,MATCH(M13,StaffDetails!$A$3:$A$1048576,FALSE)))),M12*(IF(M13=\"\",0,INDEX(StaffDetails!$D$3:$D$1048576,MATCH(M13,StaffDetails!$A$3:$A$1048576,FALSE)))))","v":0}]
[]
[null,null,"Total",{"$f":"IF(D13=\"\",\"\",SUM(D20:D69))","v":0},"","","","","","","","",""]
[null,null,"Effective Days worked \n(1 Day = 7hrs)",{"$f":"IF(D16=\"\",\"\",IF(D16>0,D16/7,\"\"))","v":""},{"$f":"IF(E16=\"\",\"\",IF(E16>0,E16/7,\"\"))","v":""},"",{"$f":"IF(G16=\"\",\"\",IF(G16>0,G16/7,\"\"))","v":""},"","","","","",""]
[]
[null,"Activity","Description",{"$f":"D13&\" Hrs\"","v":"Smith, Grantley Hrs"},{"$f":"E13&\" Hrs\"","v":" Hrs"},{"$f":"F13&\" Hrs\"","v":" Hrs"},{"$f":"G13&\" Hrs\"","v":" Hrs"}," Hrs"," Hrs"," Hrs"," Hrs"," Hrs"," Hrs",null,"Revenue A$"]
[null,1,null,null,null,null,null,null,null,null,null,null,null,null,{"$f":"SUMPRODUCT($D$14:$M$14,D20:M20)","v":0}]
{"$rows_left_out":81}
{"sheet":"RPU Budget_Template","index":1,"n_rows":112,"n_cols":20,"rows_kept":112,"cut":false,"hidden":true,"merged":[[3,1,3,4],[60,2,60,3],[60,4,60,5]]}
["BUDGET TABLE",null,null,null,"Generated on:",null,null,null,null,null,null,null,null,null,{"$f":"'Project Information'!G3&\" - \"&DAY(F1)&\"-\"&MONTH(F1)&\"-\"&YEAR(F1)","v":"WRL2020xx - 0-1-1900"}]
[]
["Project Title:"]
["Project Sponsor:"]
["Project Start Date:",null,"Project End Date:"]
[]
["UNSW Personnel:","Classification","Level","Step","Start Date","End Date","Location","UNSW Indirect %","Markup %"]
[null,{"$f":"IF(A8=\"\",\"\",VLOOKUP(A8,StaffDetails!A:K,7,FALSE))","v":""},{"$f":"IF(A8=\"\",\"\",VLOOKUP(A8,StaffDetails!A:K,8,FALSE))","v":""},{"$f":"IF(A8=\"\",\"\",VLOOKUP(A8,StaffDetails!A:K,9,FALSE))","v":""},{"$f":"IF(A8=\"\",\"\",$B$5)","v":""},{"$f":"IF(A8=\"\",\"\",$D$5)","v":""},{"$f":"IF(A8=\"\",\"\",\"UNSW (excluding Canberra campus)\")","v":""},{"$f":"IF(A8=\"\",\"\",'Project Information'!$I$2)","v":""},{"$f":"IF(A21=\"\",\"\",L21/(J21+H21))","v":""}]
[null,{"$f":"IF(A9=\"\",\"\",VLOOKUP(A9,StaffDetails!A:K,7,FALSE))","v":""},{"$f":"IF(A9=\"\",\"\",VLOOKUP(A9,StaffDetails!A:K,8,FALSE))","v":""},{"$f":"IF(A9=\"\",\"\",VLOOKUP(A9,StaffDetails!A:K,9,FALSE))","v":""},{"$f":"IF(A9=\"\",\"\",$B$5)","v":""},{"$f":"IF(A9=\"\",\"\",$D$5)","v":""},{"$f":"IF(A9=\"\",\"\",\"UNSW (excluding Canberra campus)\")","v":""},{"$f":"IF(A9=\"\",\"\",'Project Information'!$I$2)","v":""},""]
[null,{"$f":"IF(A10=\"\",\"\",VLOOKUP(A10,StaffDetails!A:K,7,FALSE))","v":""},{"$f":"IF(A10=\"\",\"\",VLOOKUP(A10,StaffDetails!A:K,8,FALSE))","v":""},{"$f":"IF(A10=\"\",\"\",VLOOKUP(A10,StaffDetails!A:K,9,FALSE))","v":""},"","","",{"$f":"IF(A10=\"\",\"\",'Project Information'!$I$2)","v":""},""]
[null,{"$f":"IF(A11=\"\",\"\",VLOOKUP(A11,StaffDetails!A:K,7,FALSE))","v":""},{"$f":"IF(A11=\"\",\"\",VLOOKUP(A11,StaffDetails!A:K,8,FALSE))","v":""},{"$f":"IF(A11=\"\",\"\",VLOOKUP(A11,StaffDetails!A:K,9,FALSE))","v":""},"","","",{"$f":"IF(A11=\"\",\"\",'Project Information'!$I$2)","v":""},""]
[null,{"$f":"IF(A12=\"\",\"\",VLOOKUP(A12,StaffDetails!A:K,7,FALSE))","v":""},{"$f":"IF(A12=\"\",\"\",VLOOKUP(A12,StaffDetails!A:K,8,FALSE))","v":""},{"$f":"IF(A12=\"\",\"\",VLOOKUP(A12,StaffDetails!A:K,9,FALSE))","v":""},"","","",{"$f":"IF(A12=\"\",\"\",'Project Information'!$I$2)","v":""},""]
[null,{"$f":"IF(A13=\"\",\"\",VLOOKUP(A13,StaffDetails!A:K,7,FALSE))","v":""},{"$f":"IF(A13=\"\",\"\",VLOOKUP(A13,StaffDetails!A:K,8,FALSE))","v":""},{"$f":"IF(A13=\"\",\"\",VLOOKUP(A13,StaffDetails!A:K,9,FALSE))","v":""},"","","",{"$f":"IF(A13=\"\",\"\",'Project Information'!$I$2)","v":""},""]
[null,{"$f":"IF(A14=\"\",\"\",VLOOKUP(A14,StaffDetails!A:K,7,FALSE))","v":""},{"$f":"IF(A14=\"\",\"\",VLOOKUP(A14,StaffDetails!A:K,8,FALSE))","v":""},{"$f":"IF(A14=\"\",\"\",VLOOKUP(A14,StaffDetails!A:K,9,FALSE))","v":""},"","","",{"$f":"IF(A14=\"\",\"\",'Project Information'!$I$2)","v":""},""]
[null,{"$f":"IF(A15=\"\",\"\",VLOOKUP(A15,StaffDetails!A:K,7,FALSE))","v":""},{"$f":"IF(A15=\"\",\"\",VLOOKUP(A15,StaffDetails!A:K,8,FALSE))","v":""},{"$f":"IF(A15=\"\",\"\",VLOOKUP(A15,StaffDetails!A:K,9,FALSE))","v":""},"","","",{"$f":"IF(A15=\"\",\"\",'Project Information'!$I$2)","v":""},""]
[null,{"$f":"IF(A16=\"\",\"\",VLOOKUP(A16,StaffDetails!A:K,7,FALSE))","v":""},{"$f":"IF(A16=\"\",\"\",VLOOKUP(A16,StaffDetails!A:K,8,FALSE))","v":""},{"$f":"IF(A16=\"\",\"\",VLOOKUP(A16,StaffDetails!A:K,9,FALSE))","v":""},"","","",{"$f":"IF(A16=\"\",\"\",'Project Information'!$I$2)","v":""},""]
[null,{"$f":"IF(A17=\"\",\"\",VLOOKUP(A17,StaffDetails!A:K,7,FALSE))","v":""},{"$f":"IF(A17=\"\",\"\",VLOOKUP(A17,StaffDetails!A:K,8,FALSE))","v":""},{"$f":"IF(A17=\"\",\"\",VLOOKUP(A17,StaffDetails!A:K,9,FALSE))","v":""},"","","",{"$f":"IF(A17=\"\",\"\",'Project Information'!$I$2)","v":""},""]
[null,{"$f":"IF(A18=\"\",\"\",VLOOKUP(A18,StaffDetails!A:K,7,FALSE))","v":""},{"$f":"IF(A18=\"\",\"\",VLOOKUP(A18,StaffDetails!A:K,8,FALSE))","v":""},{"$f":"IF(A18=\"\",\"\",VLOOKUP(A18,StaffDetails!A:K,9,FALSE))","v":""},"","","",{"$f":"IF(A18=\"\",\"\",'Project Information'!$I$2)","v":""},""]
[]
["UNSW Personnel Costs:","Period Start","Period End","FTE","Daily Rate (base salary and loadings)","Daily rate to sponsor (incl all costs)","Work Days","Base Salary Cost","Superannuation %","Total Salary On-Costs","Base Salary Plus On-Costs","Total Markup Rate ($)","UNSW MECR","POW amount to researcher","POW on-costs","Total Cost",null,null,null,"Sal_Markup_Factor"]
{"$rows_left_out":93}
{"sheet":"debug","index":2,"n_rows":1,"n_cols":1,"rows_kept":1,"cut":false,"hidden":true,"merged":[]}
["Manager"]

{"sheet":"StaffDetails","index":3,"n_rows":30,"n_cols":14,"rows_kept":30,"cut":false,"hidden":true,"merged":[]}
["Source: Rates Updated from UNSW HR Website 5/12/2018 - https://www.hr.unsw.edu.au/services/salaries",null,null,null,null,null,null,null,null,{"$f":"'Project Information'!H4","v":"2020-07-01"}]
["Name","Salary Level","Superannuation Rate","2020 Chargeout","Adjusted Charge Out - \n(Where Applicable)",null,"Classification ","Level ","Step","Daily Rate (base salary and loadings)","Daily Rate to sponsor (incl all costs)",null,"Phone","Email "]
[]
["Blacka, Anna","General Staff 4 3",0.17,125,{"$f":"IF(ISNA(HLOOKUP(StaffDetails!A4,'Project Information'!$D$13:$J$14,2,FALSE)),D4,(HLOOKUP(StaffDetails!A4,'Project Information'!$D$13:$J$14,2,FALSE)))","v":125},null,"General Staff ",{"$f":"IF(LEFT(B4,1)=\"G\", IF(RIGHT(B4,1)=\"n\",MID(B4,15,3),MID(B4,15,1)),MID(B4,16,1))","v":"4"},{"$f":"IF(LEFT(B4,1)=\"G\", IF(RIGHT(B4,1)=\"n\",RIGHT(B4,3),RIGHT(B4,1)),RIGHT(B4,1))","v":"3"},{"$f":"VLOOKUP(B4,'Salary Information'!$A:$L,MATCH($J$1,'Salary Information'!$A$1:$L$1,0),FALSE)","v":289.63701635420824},{"$f":"E4*7","v":875},null,80719837,"a.blacka@wrl.unsw.edu.au"]
["Blacka, Matthew","General Staff 8 5",0.17,250,{"$f":"IF(ISNA(HLOOKUP(StaffDetails!A5,'Project Information'!$D$13:$J$14,2,FALSE)),D5,(HLOOKUP(StaffDetails!A5,'Project Information'!$D$13:$J$14,2,FALSE)))","v":250},null,"General Staff ","8","5",{"$f":"VLOOKUP(B5,'Salary Information'!$A:$L,MATCH($J$1,'Salary Information'!$A$1:$L$1,0),FALSE)","v":484.38372556840847},1750,null,80719837,"m.blacka@wrl.unsw.edu.au"]
["Carley, James","Academic Staff C 6",0.17,300,{"$f":"IF(ISNA(HLOOKUP(StaffDetails!A6,'Project Information'!$D$13:$J$14,2,FALSE)),D6,(HLOOKUP(StaffDetails!A6,'Project Information'!$D$13:$J$14,2,FALSE)))","v":300},null,"Academic Staff ","C","6",{"$f":"VLOOKUP(B6,'Salary Information'!$A:$L,MATCH($J$1,'Salary Information'!$A$1:$L$1,0),FALSE)","v":601.86677303550061},2100,null,80719863,"james.carley@unsw.edu.au"]
["Carlino, Grace","General Staff 4 3",0.17,125,{"$f":"IF(ISNA(HLOOKUP(StaffDetails!A7,'Project Information'!$D$13:$J$14,2,FALSE)),D7,(HLOOKUP(StaffDetails!A7,'Project Information'!$D$13:$J$14,2,FALSE)))","v":125},null,"General Staff ","4","3",{"$f":"VLOOKUP(B7,'Salary Information'!$A:$L,MATCH($J$1,'Salary Information'!$A$1:$L$1,0),FALSE)","v":289.63701635420824},{"$f":"E7*7","v":875},null,80719841,"g.carlino@wrl.unsw.edu.au"]
["Coghlan, Ian","General Staff 7 4",0.17,195,{"$f":"IF(ISNA(HLOOKUP(StaffDetails!A8,'Project Information'!$D$13:$J$14,2,FALSE)),D8,(HLOOKUP(StaffDetails!A8,'Project Information'!$D$13:$J$14,2,FALSE)))","v":195},null,"General Staff ","7","4",{"$f":"VLOOKUP(B8,'Salary Information'!$A:$L,MATCH($J$1,'Salary Information'!$A$1:$L$1,0),FALSE)","v":416.23853211009174},1365,null,80719866,"i.coghlan@wrl.unsw.edu.au"]
["Cox, Ron","Academic Staff D 4",0.17,360,{"$f":"IF(ISNA(HLOOKUP(StaffDetails!A9,'Project Information'!$D$13:$J$14,2,FALSE)),D9,(HLOOKUP(StaffDetails!A9,'Project Information'!$D$13:$J$14,2,FALSE)))","v":360},null,"Academic Staff","D","4",{"$f":"VLOOKUP(B9,'Salary Information'!$A:$L,MATCH($J$1,'Salary Information'!$A$1:$L$1,0),FALSE)","v":689.39369764658954},2520,null,80719832,"r.cox@unsw.edu.au"]
["Drummond, Chris","General Staff 6 1",0.17,195,{"$f":"IF(ISNA(HLOOKUP(StaffDetails!A10,'Project Information'!$D$13:$J$14,2,FALSE)),D10,(HLOOKUP(StaffDetails!A10,'Project Information'!$D$13:$J$14,2,FALSE)))","v":195},null,"General Staff ","6","1",{"$f":"VLOOKUP(B10,'Salary Information'!$A:$L,MATCH($J$1,'Salary Information'!$A$1:$L$1,0),FALSE)","v":350.63023534104508},{"$f":"E10*7","v":1365},null,80719874,"c.drummond@wrl.unsw.edu.au"]
["Deiber, Mathieu","General Staff 6 1",0.17,185,{"$f":"IF(ISNA(HLOOKUP(StaffDetails!A11,'Project Information'!$D$13:$J$14,2,FALSE)),D11,(HLOOKUP(StaffDetails!A11,'Project Information'!$D$13:$J$14,2,FALSE)))","v":185},null,"General Staff ","6","1",{"$f":"VLOOKUP(B11,'Salary Information'!$A:$L,MATCH($J$1,'Salary Information'!$A$1:$L$1,0),FALSE)","v":350.63023534104508},1295,null,80719847,"m.deiber@wrl.unsw.edu.au"]
["Flocard, Francois","General Staff 8 1",0.17,250,{"$f":"IF(ISNA(HLOOKUP(StaffDetails!A12,'Project Information'!$D$13:$J$14,2,FALSE)),D12,(HLOOKUP(StaffDetails!A12,'Project Information'!$D$13:$J$14,2,FALSE)))","v":250},null,"General Staff ","8","1",{"$f":"VLOOKUP(B12,'Salary Information'!$A:$L,MATCH($J$1,'Salary Information'!$A$1:$L$1,0),FALSE)","v":429.90825688073397},1750,null,80719823,"f.flocard@wrl.unsw.edu.au"]
["Harrison, Alice","General Staff 6 2",0.17,185,{"$f":"IF(ISNA(HLOOKUP(StaffDetails!A13,'Project Information'!$D$13:$J$14,2,FALSE)),D13,(HLOOKUP(StaffDetails!A13,'Project Information'!$D$13:$J$14,2,FALSE)))","v":185},null,"General Staff ","6","2",{"$f":"VLOOKUP(B13,'Salary Information'!$A:$L,MATCH($J$1,'Salary Information'!$A$1:$L$1,0),FALSE)","v":362.25767850019946},1295,null,80719867,"a.harrison@wrl.unsw.edu.au"]
["Herold, Judy","General Staff 7 1",0.17,195,{"$f":"IF(ISNA(HLOOKUP(StaffDetails!A14,'Project Information'!$D$13:$J$14,2,FALSE)),D14,(HLOOKUP(StaffDetails!A14,'Project Information'!$D$13:$J$14,2,FALSE)))","v":195},null,"General Staff ","7","1",{"$f":"VLOOKUP(B14,'Salary Information'!$A:$L,MATCH($J$1,'Salary Information'!$A$1:$L$1,0),FALSE)","v":384.5911447945752},1365,null,80719848,"j.herold@wrl.unsw.edu.au"]
["Howe, Dan","General Staff 6 2",0.17,185,{"$f":"IF(ISNA(HLOOKUP(StaffDetails!A15,'Project Information'!$D$13:$J$14,2,FALSE)),D15,(HLOOKUP(StaffDetails!A15,'Project Information'!$D$13:$J$14,2,FALSE)))","v":185},null,"General Staff ","6","2",{"$f":"VLOOKUP(B15,'Salary Information'!$A:$L,MATCH($J$1,'Salary Information'!$A$1:$L$1,0),FALSE)","v":362.25767850019946},1295,null,80719856,"d.howe@wrl.unsw.edu.au"]
["Glamore, William","Academic Staff D 1",0.17,300,{"$f":"IF(ISNA(HLOOKUP(StaffDetails!A16,'Project Information'!$D$13:$J$14,2,FALSE)),D16,(HLOOKUP(StaffDetails!A16,'Project Information'!$D$13:$J$14,2,FALSE)))","v":300},null,"Academic Staff","D","1",{"$f":"VLOOKUP(B16,'Salary Information'!$A:$L,MATCH($J$1,'Salary Information'!$A$1:$L$1,0),FALSE)","v":627.61467889908261},2100,null,80719868,"w.glamore@wrl.unsw.edu.au"]
["Jenkins, Rob","General Staff 6 3",0.17,125,{"$f":"IF(ISNA(HLOOKUP(StaffDetails!A17,'Project Information'!$D$13:$J$14,2,FALSE)),D17,(HLOOKUP(StaffDetails!A17,'Project Information'!$D$13:$J$14,2,FALSE)))","v":125},null,"General Staff ","6","3",{"$f":"VLOOKUP(B17,'Salary Information'!$A:$L,MATCH($J$1,'Salary Information'!$A$1:$L$1,0),FALSE)","v":374.04068607897887},875,null,80719830,"r.jenkins@wrl.unsw.edu.au"]
["Johnson, Coral","General Staff 4 3",0.17,125,{"$f":"IF(ISNA(HLOOKUP(StaffDetails!A18,'Project Information'!$D$13:$J$14,2,FALSE)),D18,(HLOOKUP(StaffDetails!A18,'Project Information'!$D$13:$J$14,2,FALSE)))","v":125},null,"General Staff ","4","3",{"$f":"VLOOKUP(B18,'Salary Information'!$A:$L,MATCH($J$1,'Salary Information'!$A$1:$L$1,0),FALSE)","v":289.63701635420824},875,null,80719827,"c.johnson@wrl.unsw.edu.au"]
["Lumiatti, Gabriela","General Staff 5 3",0.17,185,{"$f":"IF(ISNA(HLOOKUP(StaffDetails!A19,'Project Information'!$D$13:$J$14,2,FALSE)),D19,(HLOOKUP(StaffDetails!A19,'Project Information'!$D$13:$J$14,2,FALSE)))","v":185},null,"General Staff ","5","3",{"$f":"VLOOKUP(B19,'Salary Information'!$A:$L,MATCH($J$1,'Salary Information'!$A$1:$L$1,0),FALSE)","v":319.17431192660553},1295,null,80719843,"g.lumiatti@wrl.unsw.edu.au"]
["Mathews, Ross","General Staff 5 5",0.17,125,{"$f":"IF(ISNA(HLOOKUP(StaffDetails!A20,'Project Information'!$D$13:$J$14,2,FALSE)),D20,(HLOOKUP(StaffDetails!A20,'Project Information'!$D$13:$J$14,2,FALSE)))","v":125},null,"General Staff ","5","5",{"$f":"VLOOKUP(B20,'Salary Information'!$A:$L,MATCH($J$1,'Salary Information'!$A$1:$L$1,0),FALSE)","v":338.88312724371758},875,null,80719831,"ross.mathews@unsw.edu.au"]
{"$rows_left_out":11}
{"sheet":"Salary Information","index":4,"n_rows":85,"n_cols":26,"rows_kept":85,"cut":false,"hidden":true,"merged":[]}
[null,"2019-07-01","2020-07-01","2021-01-01","2021-07-01","2022-01-01"]
["Salary Information",null,null,null,null,null,null,null,null,null,null,null,null,null,null,"https://www.hr.unsw.edu.au/services/salaries/acadsal.html"]
[null,"Daily Rate",null,null,null,null,null,null,null,null,null,null,null,null,null,"Updated 16/07/2019 from UNSW HR Website"]
[null,{"$f":"B5&B6","v":"2019  1 Jul - 30 Jun"},{"$f":"C5&C6","v":"2020 30 Jun - 31 Dec"},"2021  1 Jan - 30 Jun",{"$f":"E5&E6","v":"2022 1 Jul - 31 Dec"},"2022 1 Jan - 30 Jun","2023 1 Jul - 31 Dec",{"$f":"H5&H6","v":"2019  1 Jul - 30 Jun"},{"$f":"I5&I6","v":"2020 30 Jun - 31 Dec"},{"$f":"J5&J6","v":"2021  1 Jan - 30 Jun"},"2022 1 Jul - 31 Dec","2022 1 Jan - 30 Jun",{"$f":"M5&M6","v":"2023 1 Jul - 31 Dec"}]
[null,{"$f":"H5","v":2019},{"$f":"I5","v":2020},2021,2022,2022,2023,2019,2020,2021,2022,2022,{"$f":"K5+1","v":2023}]
["Category",{"$f":"H6","v":"  1 Jul - 30 Jun"},{"$f":"I6","v":" 30 Jun - 31 Dec"},"  1 Jan - 30 Jun"," 1 Jul - 31 Dec"," 1 Jan - 30 Jun"," 1 Jul - 31 Dec","  1 Jul - 30 Jun"," 30 Jun - 31 Dec","  1 Jan - 30 Jun"," 1 Jul - 31 Dec"," 1 Jan - 30 Jun"," 1 Jul - 31 Dec"]
["Academic Staff A 1",{"$f":"H7/250.7","v":305.42481053051455},{"$f":"I7/250.7","v":308.48025528520145},311.56362185879539,314.67889908256882,317.82608695652175,0,76570,77336,78109,78890,79679,null,79679]
["Academic Staff A 2",{"$f":"H8/250.7","v":321.57558835261273},{"$f":"I8/250.7","v":324.79058635819706},{"$f":"J8/250.7","v":328.03749501396095},{"$f":"K8/250.7","v":331.31631431990428},{"$f":"L8/250.7","v":334.63103310729957},{"$f":"M8/250.7","v":0},80619,81425,82239,83061,83892,null,83892]
["Academic Staff A 3",337.88591942560834,341.26445951336262,344.67889908256882,348.12524930195457,351.60749900279222,0,84708,85555,86411,87275,88148,null,88148]
["Academic Staff A 4",354.20821699242123,357.75029916234547,361.32828081372162,364.94216194654967,368.59194256082969,0,88800,89688,90585,91491,92406,null,92406]
["Academic Staff A 5",367.47506980454727,371.15277223773438,374.86238532110093,378.61188671719191,382.39728759473473,0,92126,93048,93978,94918,95867,null,95867,null,null,null,null,null,null,null,"01/07/2019^","01/07/2020^","01/01/2021^","01/07/2021^","01/01/2022^"]
["Academic Staff A 6",380.72995612285604,384.53928998803354,388.38452333466296,392.26964499401674,396.19066613482249,0,95449,96404,97368,98342,99325,null,99325,null,null,null,null,null,null,null,0.02,0.01,0.01,0.01,0.01]
["Academic Staff A",393.98484244116474,397.92580773833271,401.90666134822499,405.92341443956923,409.98404467491025,0,98772,99760,100758,101765,102783,null,102783]
["Academic Staff A",407.22377343438376,411.29637016354212,415.40885520542486,419.56521739130437,423.76146788990826,0,102091,103112,104143,105185,106237,null,106237]
["Academic Staff B 1",427.64260071798964,431.91862784204233,436.23853211009174,440.60231352213805,445.00598324690867,0,107210,108282,109365,110459,111563,null,135504]
["Academic Staff B 2",442.92780215396891,447.35540486637416,451.83087355404871,456.35021938571998,460.91344236138815,0,111042,112152,113274,114407,115551,null,139495]
["Academic Staff B 3",458.21300358994819,462.79218189070605,467.42321499800562,472.09413641802956,476.81691264459516,0,114874,116022,117183,118354,119538,null,143484]
["Academic Staff B 4",473.53410450737937,478.26884722776231,483.05145592341444,487.88193059433587,492.76027124052655,0,118715,119902,121101,122312,123535,null,147477]
["Academic Staff B 5",488.82329477463105,493.70961308336661,498.64778619864381,503.63382528919027,508.67171918627844,0,122548,123773,125011,126261,127524,null,151465]
["Academic Staff B 6",504.13242919824495,509.17431192660553,514.26406063023535,519.40566414040688,524.59912245712007,0,126386,127650,128926,130215,131517,null,155460]
{"$rows_left_out":65}